Home » Top laufzeitfehler 429 objekterstellung durch activex komponente ist nicht möglich New Update

Top laufzeitfehler 429 objekterstellung durch activex komponente ist nicht möglich New Update

by Tratamien Torosace

You are viewing this post: Top laufzeitfehler 429 objekterstellung durch activex komponente ist nicht möglich New Update

Siehe Thema laufzeitfehler 429 objekterstellung durch activex komponente ist nicht möglich

Table of Contents

Objekterstellung durch ActiveX-Komponente ist nicht möglich Neueste

Updating

+ mehr hier sehen

How To Fix Run Time Error – 429 || ActiveX Component Can’t Create Object Error Update

Video ansehen

Neue Informationen zum Thema laufzeitfehler 429 objekterstellung durch activex komponente ist nicht möglich

Hii Friends Welcome Back My Channel MK Tech……………………..

In This Tutorial How To Fix Run Time Error – 429……………………………..

Follow My Tutorial Steps Properly………………………………..

Thanks For Watching……………………………………………….
,,,,,,,,,,,,,,,,,,,,,,,,,,,,,,,,,,,,,,,,,,,,,,,,,,,,,,,,,,,,,,,,,,,,,,,,,,,,,,,,,,,,,,,,,,,,,,,,,,,,,,,,,,,,,,,,,,,,,,,,

laufzeitfehler 429 objekterstellung durch activex komponente ist nicht möglich Einige Bilder im Thema

 New Update How To Fix Run Time Error - 429 || ActiveX Component Can't Create Object Error
How To Fix Run Time Error – 429 || ActiveX Component Can’t Create Object Error Update New

Problembehandlung von Fehler 429 bei Automatisierung von … Neueste

244264 INFO: Troubleshooting Error 429 When Automating Office Applications … Laufzeitfehler429‘: Objekterstellung durch ActiveXKomponente nicht möglich.

+ Details hier sehen

Runtime Error 429 ActiveX Component Can’t Create Object | How to fix ActiveX Error on Windows 10 Update New

Video ansehen

Neues Update zum Thema laufzeitfehler 429 objekterstellung durch activex komponente ist nicht möglich

Runtime Error 429 ActiveX Component Can’t Create Object | How to fix ActiveX Error on Windows 10
[ Gift ] Like this video \u0026 Add this to Chrome for FREE [ https://bit.ly/AnimSearch ]
This knowledge base will guide you through the steps on Runtime Error 429 ActiveX Component Can’t Create Object | How to fix ActiveX Error on Windows 10
Runtime Error 429 ActiveX Component Can’t Create Object | How to fix ActiveX Error on Windows 10
Run-time error 429 ActiveX; ActiveX component can not create object
Solution):
This error can occur for ActiveX or .NET COM DLL being accessed is registered on the system.
Install the Microsoft .NET Framework if it is not installed.
Close all open applications and delete the files in the folder% TEMP%. To easily access this folder, open a command prompt and type the following pressing Enter after each line:
CD% TEMP%
DEL *. * / S
Getting the latest version of the product IDAutomation Barcode used.
Reinstall the component package. It should automatically register the DLL.
If the problem continues, try the manual process below.
To register the DLL manually, do the following:
Open a command window as Administrator. It is usually located in the Start – Programs – Accessories or type cmd from the search area.
Changes to the DLL directory is located at; which typically% systemroot% \\ System32. On 64-bit systems, the DLL may also be in the% systemroot% \\ syswow64. In the 64-bit version of Windows, there are two versions of the file Regsv32.exe:
64-bit version is% systemroot% \\ System32 \\ regsvr32.exe, where 64-bit DLL is located.
32-bit version is% systemroot% \\ SysWoW64 \\ regsvr32.exe, where 32-bit DLL is located.
Type the following at the command prompt:
REGSVR32 file.dll
where file.dll is the name of the DLL to be registered.
If the error DLL entry-point DllRegisterServer received after running regsvr32, the DLL must be registered regasm.exe instead. To do this, verify Framework is installed and type the following at the command prompt:
For the .NET Framework 2.0 to 3.5:
C: \\ Windows \\ Microsoft.NET \\ Framework \\ v2.0.50727 \\ regasm.exe / codebase / TLB file.dll
For .NET Framework 4:
C: \\ Windows \\ Microsoft.NET \\ Framework \\ v4.0.30319 \\ regasm.exe / codebase / TLB file.dll
where file.dll is the name of the DLL to be registered and the C: \\ Windows \\ Microsoft.NET \\ Framework \\ * is the path to the file regasm.exe
Runtime Error 429 ActiveX Component Can’t Create Object | How to fix ActiveX Error on Windows 10
#Runtime #Error #ActiveX #Component #Can’t #Create #Object #How #to #fix

See also  Best Choice class 1 usb bluetooth adapter Update

Disclaimer: This video comes under how to fix category. The tutorial mentioned works for Windows 10, Windows 8 and Windows 7. This will work on your computer, desktop and laptop. We have tested our video resources on Dell, HP, Acer, Asus manufacturers. For any issues contact our Knowledge Base team.
Language : English
Related Searches : [ How to fix your computer, knowledge base, windows 10, windows 8, windows 7 ]

laufzeitfehler 429 objekterstellung durch activex komponente ist nicht möglich Einige Bilder im Thema

 Update Runtime Error 429 ActiveX Component Can't Create Object | How to fix ActiveX Error on Windows 10
Runtime Error 429 ActiveX Component Can’t Create Object | How to fix ActiveX Error on Windows 10 New

Sie erhalten Laufzeitfehler 429, wenn Sie Office … New Update

Behebt ein Problem, bei dem Sie Laufzeitfehler 429: “ActiveXKomponente kann kein Objekt erstellen” erhalten, wenn Sie Office-Anwendungen automatisieren.

+ hier mehr lesen

Runtime Error 429 Activex Component Can’t Create Object In Windows 10 (FIXED) New Update

Video unten ansehen

Neue Informationen zum Thema laufzeitfehler 429 objekterstellung durch activex komponente ist nicht möglich

Download Microsoft Access Database Engine 2010 Redistributable click here: https://www.microsoft.com/en-ca/download/details.aspx?id=13255
1. Start ActiveX Installer (AxInstSV) service
2. Install Microsoft Access Database Engine 2010 Redistributable

laufzeitfehler 429 objekterstellung durch activex komponente ist nicht möglich Einige Bilder im Thema

 Update Runtime Error 429 Activex Component Can't Create Object In Windows 10 (FIXED)
Runtime Error 429 Activex Component Can’t Create Object In Windows 10 (FIXED) Update

So beheben Sie den Laufzeitfehler 429 unter Windows 10 und … Update

Behebung des Laufzeitfehlers429‘: Die ActiveXKomponente kann das Objekt nicht erstellen · Lösung 1: Führen Sie einen SFC-Scan durch · Lösung 2: Registrieren …

+ mehr hier sehen

How To Fix Run time Error 429 – ActiveX Component Can’t Create Object Windows 10/8/7 Update New

Video unten ansehen

Weitere hilfreiche Informationen im Thema anzeigen laufzeitfehler 429 objekterstellung durch activex komponente ist nicht möglich

#RuntimeError429 #ActiveXComponent #CannotCreateOblect
Hii Friends Welcome Back My Channel MK Tech …….
In This Tutorial How To Fix Run time Error 429 – ActiveX Component Can’t Create Object Windows 10/8/7
Follow My Tutorial Steps Properly ……..
Thanks For Watching …….
,,,,,,,,,,,,

laufzeitfehler 429 objekterstellung durch activex komponente ist nicht möglich Einige Bilder im Thema

 Update How To Fix Run time Error 429 - ActiveX Component Can't Create Object Windows 10/8/7
How To Fix Run time Error 429 – ActiveX Component Can’t Create Object Windows 10/8/7 Update New

"Laufzeitfehler '429': ActiveX-Komponente kann kein Objekt … Update

Fehlermeldung: “Laufzeitfehler429‘: ActiveXKomponente kann kein Objekt erstellen”

+ hier mehr lesen

Runtime Error 429 ActiveX Component Can’t Create FIX New

Video unten ansehen

Neue Informationen zum Thema laufzeitfehler 429 objekterstellung durch activex komponente ist nicht möglich

Runtime Error 429 ActiveX Component Can’t Create FIX
Commands Shown:
DISM.exe /Online /Cleanup-image /Restorehealth
sfc /scannow
While running the software the ‘Runtime Error ‘429’: ActiveX Component Can’t Create Object’ error occurs and the program shuts down.
The ActiveX error 429 is a run-time error that some end users have encountered in Windows. The error usually ensures that an open application comes to an abrupt halt and closes.
It also returns an error message stating, “Run-time error ‘429’: ActiveX component can’t create object.” Error 429 is most frequent for MS Office applications, such as Excel, Word, Access or Outlook, with automated Visual Basic sequence scripts.
Error 429 is largely a consequence of software attempting to access corrupted files. Thus, the automation sequence can’t operate as scripted to. This could be due to corrupted registry, deleted OS files, incomplete installation of software or corrupted system files.
So there are various potential fixes for ActiveX error 429.
Issues addressed in this tutorial:
runtime error 429 ActiveX component can’t create object windows 7
runtime error 429 ActiveX can’t create object
runtime error 429 ActiveX component can’t create object windows 10
runtime error 429 windows 10
runtime error 429 Microsoft visual basic
runtime error 429 ActiveX component can’t create object in excel
runtime error 429 ActiveX component can’t create object
runtime error 429 in excel
runtime error 429 pastel
runtime error 429 VBA excel
This tutorial will apply for computers, laptops, desktops,and tablets running the Windows 10 operating system (Home, Professional, Enterprise, Education) from all supported hardware manufactures, like Dell, HP, Acer, Asus, Toshiba, Lenovo, and Samsung.

laufzeitfehler 429 objekterstellung durch activex komponente ist nicht möglich Einige Bilder im Thema

 Update New Runtime Error 429 ActiveX Component Can't Create FIX
Runtime Error 429 ActiveX Component Can’t Create FIX New

Laufzeitfehler 429 – Objekterstellung durch Active – Herbers … New

dann kommt folgende Fehlermeldung: Laufzeitfehler 429Objekterstellung durch ActiveX-Komponente ist nicht möglich. Ich habe doch nichts geändert.

+ mehr hier sehen

ActiveX Component Can’t Create Object [Fixed] Runtime Error 429 Update New

Video unten ansehen

Weitere Informationen zum Thema laufzeitfehler 429 objekterstellung durch activex komponente ist nicht möglich

ActiveX Component Can’t Create Object | Runtime Error 429
[ Gift ] Like this video \u0026 Add this to Chrome for FREE [ https://bit.ly/AnimSearch ]
This knowledge base will guide you through the steps on How to fix ActiveX Component Can’t Create Object | Runtime Error 429
#ActiveX #Component #Can’t #Create #Object #Runtime #Error
Disclaimer: This video comes under how to fix category. The tutorial mentioned works for Windows 10, Windows 8 and Windows 7. This will work on your computer, desktop and laptop. We have tested our video resources on Dell, HP, Acer, Asus manufacturers. For any issues contact our Knowledge Base team.
Language : English
Related Searches : [ How to fix your computer, knowledge base, windows 10, windows 8, windows 7 ]

laufzeitfehler 429 objekterstellung durch activex komponente ist nicht möglich Einige Bilder im Thema

 New Update ActiveX Component Can't Create Object [Fixed] Runtime Error 429
ActiveX Component Can’t Create Object [Fixed] Runtime Error 429 New Update

Objekterstellung durch ActiveX-Komponente nicht möglich Update New

5. Die Fehlermeldung lautet: Microsoft Visual Basic, Laufzeitfehler429‘: Objekterstellung durch AktiveX-Komponente nicht möglich! Die …

+ hier mehr lesen

Runtime Error 429 ActiveX Component can’t create object Windows 10 FIXED Update

Video ansehen

Neue Informationen zum Thema laufzeitfehler 429 objekterstellung durch activex komponente ist nicht möglich

Runtime Error 429 ActiveX Component can’t create object Windows 10
[ Gift ] Like this video \u0026 Add this to Chrome for FREE [ https://bit.ly/AnimSearch ]
Runtime Error 429 ActiveX Component can’t create object Windows 10
How can I fix ActiveX runtime error 429 in Windows 10?
Register Program
If a special program generates ActiveX errors, the software may not be configured correctly. You can fix this by re-register the software with the / regserver switch, which solve the problem with the automation server.
This is how you can register the software with the Run:
First, make sure you have admin rights to the Windows admin account.
Press Win + R hotkey to open the Run.
Enter the full path of the software followed by / regserver in the text box as shown below. Enter the exact path, including exe, software that you need to reregister.

See also  Best Choice jak obrócić obiekt w photoshopie Update New

Press the OK button
#Runtime #Error 429 #ActiveX #Component #can’t #create #object #Windows
Disclaimer: This video comes under how to fix category. The tutorial mentioned works for Windows 10, Windows 8 and Windows 7. This will work on your computer, desktop and laptop. We have tested our video resources on Dell, HP, Acer, Asus manufacturers. For any issues contact our Knowledge Base team.
Language : English
Related Searches : [ How to fix your computer, knowledge base, windows 10, windows 8, windows 7 ]

laufzeitfehler 429 objekterstellung durch activex komponente ist nicht möglich Ähnliche Bilder im Thema

 New Runtime Error 429 ActiveX Component can't create object Windows 10 FIXED
Runtime Error 429 ActiveX Component can’t create object Windows 10 FIXED Update

VBA – Laufzeitfehler 429: Objekterstellung durch ActiveX … Aktualisiert

Laufzeitfehler 429: Objekterstellung durch ActiveX-Komponente nicht möglich Microsoft Excel.

+ ausführliche Artikel hier sehen

Mendeley plugin: error 429 New

Video unten ansehen

Weitere Informationen zum Thema laufzeitfehler 429 objekterstellung durch activex komponente ist nicht möglich

Como resolver o erro \”Erro em tempo de execução ‘429’: O Componente ActiveX não pode criar objeto\” no Mendeley plugin para o MS Word.
How to solve Error message: \”Run-time error ‘429’: ActiveX component cannot create object\” in Mendeley plugin MS Word.
Full path to the damn file: \”C:\\Program Files (x86)\\Mendeley Desktop\\MendeleyWordPlugin\”
Visite: https://www.theanswerisfortytwo.org/

laufzeitfehler 429 objekterstellung durch activex komponente ist nicht möglich Sie können die schönen Bilder im Thema sehen

 New Mendeley plugin: error 429
Mendeley plugin: error 429 Update

Laufzeitfehler 429 beheben ActiveX-Komponente kann Objekt … Neueste

Benutzer haben gemeldet, dass die Fehlermeldung“Laufzeitfehler 429: ActiveXKomponente kann kein Objekt erstellen” auf einem Windows-PC, …

+ hier mehr lesen

[Fix] Runtime Error 429 ActiveX Component Can’t Create Object In Windows 10 Update New

Video unten ansehen

Neue Informationen zum Thema laufzeitfehler 429 objekterstellung durch activex komponente ist nicht möglich

[Fix] Runtime Error 429 Activex Component Can’t Create Object In Windows 10.
The ActiveX error 429 is a run-time error that some end users have encountered in Windows. The error usually ensures that an open application comes to an abrupt halt and closes.
Runtime errors are typically the result of issues with computer software. However, each individual runtime error has an assigned number which indicates to the end user the actual cause.
Issues addressed in this tutorial:
runtime error 429 activex component can’t create object,
runtime error 429 activex component can’t create object windows 7
runtime error 429 activex can’t create object
runtime error 429 activex component can’t create object windows 10
run-time error 429 activex component
runtime error 429 activex windows 7 64 bit
runtime error 429 microsoft visual basic
runtime error 429 activex component can’t create object in excel
run-time error 429 excel
runtime error 429 vba
runtime error 429 windows 7
It also returns an error message stating, “Run-time error ‘429’: ActiveX component can’t create object.” Error 429 is most frequent for MS Office applications, such as Excel, Word, Access or Outlook, with automated Visual Basic sequence scripts.
Error 429 is largely a consequence of software attempting to access corrupted files. Thus, the automation sequence can’t operate as scripted to. This could be due to corrupted registry, deleted OS files, incomplete installation of software or corrupted system files.
Run-time error 429 is a Visual Basic error often seen when creating instances in MS Office or other programs that depends or use Visual Basic. This error occurs when the Component Object Model (COM) cannot create the requested Automationobject, and the Automation object is, therefore, unavailable to Visual Basic. This error does not occur on all computers.
Many Windows users have reported experiencing over the years and over the many different iterations of the Windows Operating System that have been developed and distributed. In the majority of reported cases, Run-time error 429 rears its ugly head while the affected user is using a specific application on their Windows computer, and the error results in the affected application crashing and closing down abruptly.
So there are various potential fixes for ActiveX error 429.Error 429 is largely a consequence of software attempting to access corrupted files. Thus, the automation sequence can’t operate as scripted to. This could be due to corrupted registry, deleted OS files, incomplete installation of software or corrupted system files.
This tutorial will apply for computers, laptops, desktops,and tablets running the Windows 10 operating system (Home, Professional, Enterprise, Education) from all supported hardware manufactures, like Dell, HP, Acer, Asus, Toshiba,Lenovo, and Samsung).

laufzeitfehler 429 objekterstellung durch activex komponente ist nicht möglich Ähnliche Bilder im Thema

 Update [Fix] Runtime Error 429 ActiveX Component Can't Create Object In Windows 10
[Fix] Runtime Error 429 ActiveX Component Can’t Create Object In Windows 10 New Update

MS Visual Basic Laufzeitfehler 429 – Supportnet.de Update New

“MS Visual Basic Laufzeitfehler429‘: Objekterstellung durch ActiveX-Komponente nicht möglich.” Hallo, diese Fehlermeldung bekomme ich seit kurzem, …

+ mehr hier sehen

How To Fix Runtime Error 429 Activex Component Can’t Create Object In Windows 10 Update

Video unten ansehen

Weitere Informationen zum Thema laufzeitfehler 429 objekterstellung durch activex komponente ist nicht möglich

Thank You Everyone So Much For Watch My Video On \” How To Fix Runtime Error 429 Activex Component Can’t Create Object In Windows 10 \”. I Hope This Was Useful And You Learned Something Interesting.
You Can Try And It’s All Work Perfectly.
#runtimeerror #429 #windows
LIKE | SHARE | SUBSCRIBE FOR MORE VIDEOS
THANKS FOR WATCHING
============================
Hope \” How To Fix Runtime Error 429 Activex Component Can’t Create Object In Windows 10 \” useful content.

laufzeitfehler 429 objekterstellung durch activex komponente ist nicht möglich Ähnliche Bilder im Thema

 New How To Fix Runtime Error 429 Activex Component Can't Create Object In Windows 10
How To Fix Runtime Error 429 Activex Component Can’t Create Object In Windows 10 New

Weitere Informationen zum Thema laufzeitfehler 429 objekterstellung durch activex komponente ist nicht möglich

Objekterstellung durch ActiveX-Komponente ist nicht möglich … New

Der lädt kurz und bringt dann den Fehler: Laufzeitfehler 429Objekterstellung durch ActiveX-Komponente ist nicht möglich!

+ ausführliche Artikel hier sehen

How To Fix Run Time Error – 429 || ActiveX Component Can’t Create Object Error Update

Video ansehen

Neue Informationen zum Thema laufzeitfehler 429 objekterstellung durch activex komponente ist nicht möglich

Hii Friends Welcome Back My Channel MK Tech……………………..

In This Tutorial How To Fix Run Time Error – 429……………………………..

Follow My Tutorial Steps Properly………………………………..

Thanks For Watching……………………………………………….
,,,,,,,,,,,,,,,,,,,,,,,,,,,,,,,,,,,,,,,,,,,,,,,,,,,,,,,,,,,,,,,,,,,,,,,,,,,,,,,,,,,,,,,,,,,,,,,,,,,,,,,,,,,,,,,,,,,,,,,,

laufzeitfehler 429 objekterstellung durch activex komponente ist nicht möglich Einige Bilder im Thema

 New Update How To Fix Run Time Error - 429 || ActiveX Component Can't Create Object Error
How To Fix Run Time Error – 429 || ActiveX Component Can’t Create Object Error Update New

Laufzeitfehler 429 Objekterstellung ActiveX-Komponente … Update

Laufzeitfehler 429: Objekterstellung durch ActiveX-Komponente nicht möglich. der Quellcode sieht wie folgt aus: Code: Sub AppendLog(aIn As …

+ ausführliche Artikel hier sehen

How To Enable ActiveX On Windows 10 [Tutorial] New

Video unten ansehen

Neues Update zum Thema laufzeitfehler 429 objekterstellung durch activex komponente ist nicht möglich

How To Enable ActiveX On Windows 10 [Tutorial]
Issues addressed in this tutorial:
enable ActiveX in chrome windows 10
enable ActiveX controls in windows 10
ActiveX windows 10
ActiveX download windows 10
This tutorial will apply for computers, laptops, desktops, and tablets running the Windows 10 operating system (Home, Professional, Enterprise, Education) from all supported hardware manufactures, like Dell, HP, Acer, Asus, Toshiba, Lenovo, and Samsung.

laufzeitfehler 429 objekterstellung durch activex komponente ist nicht möglich Einige Bilder im Thema

 Update How To Enable ActiveX On Windows 10 [Tutorial]
How To Enable ActiveX On Windows 10 [Tutorial] Update

Laufzeitfehler 429 – Supportnet Update

… das Programm Flowfact free zu starten, erhalte ich folgende Fehlermeldung: Laufzeitfehler 429: Objekterstellung durch ActiveX-Komponente nicht möglich.

+ Details hier sehen

See also  Best Choice comics kostenlos lesen New

This document contain macros, ActiveX control, XML expansion pack | Excel Error Fix | TechnoTubebd New

Video unten ansehen

Weitere hilfreiche Informationen im Thema anzeigen laufzeitfehler 429 objekterstellung durch activex komponente ist nicht möglich

Welcome Friends!
In this video, I am going to show you How to fix This document contain macros, ActiveX control, an XML expansion pack. By following the instruction of this video you may Fix this type of Excel Error. Please surfing our channel’s other videos to gather knowledge about fixing other IT-related issues.
\”Don’t Forget to SUBSCRIBE, Like, Comment and Share this Video\”
For Business Queries: [email protected]

🙏 Subscribe to me pls (Subscribe করুন!)
🔔 Pls Press the Bell Button (আর পাশের Bell বাটনে ক্লিক করুন! )
►► Follow me on
🛑TechnotubeBD on Social Media
Subscribe: https://bit.ly/2XZdodb
Android App: https://technotubebd.com/app
Youtube: http://www.youtube.com/c/Technotubebd
Twitter: http://www.twitter.com/TechnoTubeBD1
Facebook: http://www.facebook.com/technotube.bd
Facebook Page: https://www.facebook.com/meshukmizan/
Instagram: https://instagram.com/technotubebd
Website: https://technotubebd.com/
Pinterest: https://pinterest.com/technotubebd
About :
———–
TechnotubeBD is a YouTube Channel, where you will find technological videos in Bangla with English subtitle, New Video is Posted Every week 🙂
Music CopyRight Section:
——————————
Disclaimer:-
This Channel does not promote any illegal content, Does not encourage any kind of illegal activities. All contents provided by this channel is meant for EDUCATIONAL purpose only.
#Technotubebd #Excel_Error

laufzeitfehler 429 objekterstellung durch activex komponente ist nicht möglich Sie können die schönen Bilder im Thema sehen

 Update This document contain macros, ActiveX control, XML expansion pack | Excel Error Fix | TechnoTubebd
This document contain macros, ActiveX control, XML expansion pack | Excel Error Fix | TechnoTubebd New Update

Objekterstellung durch ActiveX-Komponente nicht möglich New

Diese funktioniert seit einiger Zeit nicht mehr. Sobald man das Programm startet gibt der folgende Fehlermeldung aus: Laufzeitfehler429‘.

+ mehr hier sehen

Excel Error – ActiveX component can’t create object New

Video ansehen

Neues Update zum Thema laufzeitfehler 429 objekterstellung durch activex komponente ist nicht möglich

Troubleshooting Excel Error:
‘ActiveX component can’t create object’
‘Automation Server Can’t Create Object’

laufzeitfehler 429 objekterstellung durch activex komponente ist nicht möglich Einige Bilder im Thema

 Update Excel Error - ActiveX component can’t create object
Excel Error – ActiveX component can’t create object New

Laufzeitfehler 429 ActiveX Update

Installierte Komponenten: Windows XP SP2 Office 2003 SP1 Acrobat 5.0.5 … Objekterstellung durch ActiveXKomponente nicht möglich. Laufzeitfehler 429

+ ausführliche Artikel hier sehen

HOW TO FIX!!! MENDELEY DESKTOP MS. WORD PLUGIN ERROR!!! New

Video ansehen

Weitere Informationen zum Thema laufzeitfehler 429 objekterstellung durch activex komponente ist nicht möglich

Hallo ges…
Di video ini saya menjelaskan bagaimana cara untuk mengatasi Mendeley Desktop MS. WORD Plugin yang bermasalah dan tidak muncul di menu references Microsoft Word,,,Mau tau bagaimana cara mengatasinya??? yuk kita simak video berikut ini.
#mendeley #msword #pluginerror
Tonton Juga Playlist [J2] Project18:
#J2Education : https://www.youtube.com/watch?v=qgTIMlarldA\u0026list=PLvT7-AKYOYMxx3N_GNgl18tLvzXKRiLN_
#J2Games : https://www.youtube.com/watch?v=LqiURcCS_8U\u0026list=PLvT7-AKYOYMwMeHVQ7kuf5I4uhpRrOr0D
#J2Arts : https://www.youtube.com/watch?v=K7blA3PMbXU\u0026list=PLvT7-AKYOYMzMzplkmBwGk_VGSsDOV1Zx
#J2LifeStyle : https://www.youtube.com/watch?v=Z3KFzhn4ztY\u0026list=PLvT7-AKYOYMzL_TDdLCbHKmkczTYUObMV
#J2Foods : https://www.youtube.com/playlist?list=PLvT7-AKYOYMxY4oMyXO44CBKN5mCYVBsL
==============================================================================
Support saya dengan like dan subscribe channel ini :
https://www.youtube.com/j2project18
==============================================================================
follow saya juga di instagram :
@jordy_lp (pribadi) : https://www.instagram.com/jordy_lp
@j2.project18 : https://www.instagram.com/j2.project18
@pacinkoolshop : https://www.instagram.com/pacinkoolshop

laufzeitfehler 429 objekterstellung durch activex komponente ist nicht möglich Einige Bilder im Thema

 Update HOW TO FIX!!! MENDELEY DESKTOP MS. WORD PLUGIN ERROR!!!
HOW TO FIX!!! MENDELEY DESKTOP MS. WORD PLUGIN ERROR!!! New

Laufzeitfehler 429 mit ADODB in Windows 7 Prof – [email protected] Aktualisiert

429, Objekterstellung durch ActiveXKomponente nicht möglich … DNS via ODBC oder die alte Access 2000 DB kann ich auch nicht öffnen!!!

+ mehr hier sehen

Fix Run-time error 429 when running Microsoft Office app Update

Video ansehen

Neues Update zum Thema laufzeitfehler 429 objekterstellung durch activex komponente ist nicht möglich

This vid helps Fix Run-time error 429 while trying to open/run your Microsoft Office app, such as Excel, Word and alike.
If running repair didn’t work for you, or you need to remove Abbyy Finereader effectively, you can use this top-rated uninstall tool [email protected] https://macpaw.7eer.net/c/376211/297731/1733 (for Windows users), or this [email protected] https://macpaw.7eer.net/c/376211/117945/1733 (works for Mac users)

laufzeitfehler 429 objekterstellung durch activex komponente ist nicht möglich Sie können die schönen Bilder im Thema sehen

 Update Fix Run-time error 429 when running Microsoft Office app
Fix Run-time error 429 when running Microsoft Office app New

Laufzeitfehler 429 – Access-o-Mania New

MsgBox “Keine Fussnoten vorhanden”, vbCritical. End If For X = 1 To Word.ActiveDocument.Paragraphs.Count fussnote = Word.ActiveDocument.

+ mehr hier sehen

ERROR 429 ACTIVEX COMPONENT CAN´T CREATE OBJETS S10 EN VISTA DEL PRESUPUESTO | WillNetwork° New

Video unten ansehen

Weitere hilfreiche Informationen im Thema anzeigen laufzeitfehler 429 objekterstellung durch activex komponente ist nicht möglich

SOLUCIONAR EL ERROR 429 ACTIVEX COMPONENT CAN´T CREATE OBJETS S10 EN VISTA PRELIMINAR DEL PRESUPUESTO
Contacto:
https://www.facebook.com/wfuentesc
https://www.instagram.com/willanfuentes
WhatsApp: ‭+51 926023651
#WillNetwork

laufzeitfehler 429 objekterstellung durch activex komponente ist nicht möglich Einige Bilder im Thema

 Update ERROR 429 ACTIVEX COMPONENT CAN´T CREATE OBJETS S10 EN VISTA DEL PRESUPUESTO | WillNetwork°
ERROR 429 ACTIVEX COMPONENT CAN´T CREATE OBJETS S10 EN VISTA DEL PRESUPUESTO | WillNetwork° Update

Laufzeitfehler 429 Objekterstellung durch Active X … New Update

Beschreibung: Bei der Fehlermeldung Laufzeitfehler 429Objekterstellung durch ActiveX-Komponente ist nicht möglich handelt es sich um eine …

+ ausführliche Artikel hier sehen

how to fix Error 429 ActiveX component can’t create object Update New

Video ansehen

Weitere Informationen zum Thema laufzeitfehler 429 objekterstellung durch activex komponente ist nicht möglich

how to fix Error 429 ActiveX component can’t create object

laufzeitfehler 429 objekterstellung durch activex komponente ist nicht möglich Sie können die schönen Bilder im Thema sehen

 Update how to fix Error 429 ActiveX component can't create object
how to fix Error 429 ActiveX component can’t create object New

Laufzeitfehler 429 Vermutlich ein VBA Fehler – Administrator.de Neueste

Wie lautet die Fehlermeldung ganz genau? Laufzeittfehler ´429´ Objekterstellung durch ActiveXKomponente nicht möglich

+ ausführliche Artikel hier sehen

ActiveX Component Can’t Create Object Excel – Quick Fix Update New

Video ansehen

Weitere hilfreiche Informationen im Thema anzeigen laufzeitfehler 429 objekterstellung durch activex komponente ist nicht möglich

ActiveX Component Can’t Create Object Excel – Quick Fix.
Command Used:
regsvr32 scrrun.dll
Issues addressed in this tutorial:
ActiveX component can’t create object or return reference to this object (error 429)
ActiveX component can’t create object 429
ActiveX component can’t create object vb6
ActiveX component can’t create object excel
ActiveX component can’t create object vba windows 10
ActiveX can’t create object
ActiveX component can’t create object error 429
ActiveX component can’t create object excel windows 10
ActiveX component can’t create object excel 365
ActiveX component can’t create object error in excel
error 429 ActiveX component can’t create object
The ActiveX error 429 is a run-time error that some end users have encountered in Windows. The error usually ensures that an open application comes to an abrupt halt and closes.
If you’re encountering Runtime error 429, ActiveX component can’t create object on your Windows 10 computer when you attempt to create instances in programs which use Visual Basic (eg. Microsoft Office), then this post is intended to help you. In this post, we will identify the possible causes, as well as provide the most appropriate solutions you can try to help you remediate this issue.
It also returns an error message stating, “Run-time error ‘429’: ActiveX component can’t create object.” Error 429 is most frequent for MS Office applications, such as Excel, Word, Access or Outlook, with automated Visual Basic sequence scripts.
Error 429 is largely a consequence of software attempting to access corrupted files. Thus, the automation sequence can’t operate as scripted to. This could be due to corrupted registry, deleted OS files, incomplete installation of software or corrupted system files.
This tutorial will apply for computers, laptops, desktops, and tablets running the Windows 10, Windows 8/8.1, Windows 7 operating systems. Works for all major computer manufactures (Dell, HP, Acer, Asus, Toshiba, Lenovo, Samsung).

laufzeitfehler 429 objekterstellung durch activex komponente ist nicht möglich Einige Bilder im Thema

 New ActiveX Component Can't Create Object Excel - Quick Fix
ActiveX Component Can’t Create Object Excel – Quick Fix Update

Dies ist eine Suche zum Thema laufzeitfehler 429 objekterstellung durch activex komponente ist nicht möglich

objekterstellung durch activex-komponente nicht möglichobjekterstellung durch activex-komponente nicht möglich wordoutlook activex-komponente kann nicht erstellt werdenfehler bei der initialisierung des zielsystems 429objekterstellung durch activex-komponente nicht möglich mendeley

Ende des Themas laufzeitfehler 429 objekterstellung durch activex komponente ist nicht möglich

Articles compiled by Tratamientorosacea.com. See more articles in category: FINANCE

Related Videos

Leave a Comment